FailedConsole Output

Started by [email protected] on request of 'mcmonkey'
Building in workspace /var/lib/jenkins/jobs/Denizen2Sponge/workspace
 > git rev-parse --is-inside-work-tree # timeout=10
Fetching changes from the remote Git repository
 > git config remote.origin.url git://github.com/DenizenScript/Denizen2Sponge.git # timeout=10
Fetching upstream changes from git://github.com/DenizenScript/Denizen2Sponge.git
 > git --version # timeout=10
 > git -c core.askpass=true fetch --tags --progress git://github.com/DenizenScript/Denizen2Sponge.git +refs/heads/*:refs/remotes/origin/*
 > git rev-parse origin/master^{commit} # timeout=10
Checking out Revision 3ba59403feaa10e988026a0fd94b481826b25e0c (origin/master)
 > git config core.sparsecheckout # timeout=10
 > git checkout -f 3ba59403feaa10e988026a0fd94b481826b25e0c
 > git rev-list fc3a54a0fc6a75864790bec49a1bda375d6e20aa # timeout=10
 > git tag -a -f -m Jenkins Build #28 jenkins-Denizen2Sponge-28 # timeout=10
Parsing POMs
Established TCP socket on 38686
[workspace] $ /var/lib/jenkins/tools/hudson.model.JDK/JDK8/bin/java -Djava.awt.headless=true -cp /var/lib/jenkins/plugins/maven-plugin/WEB-INF/lib/maven3-agent-1.7.jar:/var/lib/jenkins/tools/hudson.tasks.Maven_MavenInstallation/Maven_3.0.3/boot/plexus-classworlds-2.4.jar org.jvnet.hudson.maven3.agent.Maven3Main /var/lib/jenkins/tools/hudson.tasks.Maven_MavenInstallation/Maven_3.0.3 /var/cache/jenkins/war/WEB-INF/lib/remoting-3.7.jar /var/lib/jenkins/plugins/maven-plugin/WEB-INF/lib/maven3-interceptor-1.7.jar /var/lib/jenkins/plugins/maven-plugin/WEB-INF/lib/maven3-interceptor-commons-1.7.jar 38686
<===[JENKINS REMOTING CAPACITY]===>channel started
Executing Maven:  -B -f /var/lib/jenkins/jobs/Denizen2Sponge/workspace/pom.xml clean install
[INFO] Scanning for projects...
[INFO]                                                                         
[INFO] ------------------------------------------------------------------------
[INFO] Building Denizen2Sponge 0.3.0
[INFO] ------------------------------------------------------------------------
Downloading: https://repo.spongepowered.org/maven/org/spongepowered/spongeapi/7.0.0-SNAPSHOT/maven-metadata.xml
Downloading: http://repo.citizensnpcs.co/org/spongepowered/spongeapi/7.0.0-SNAPSHOT/maven-metadata.xml
Downloaded: https://repo.spongepowered.org/maven/org/spongepowered/spongeapi/7.0.0-SNAPSHOT/maven-metadata.xml (363 B at 0.3 KB/sec)
Downloading: https://repo.spongepowered.org/maven/org/spongepowered/spongeapi/7.0.0-SNAPSHOT/spongeapi-7.0.0-20170911.153654-37.pom
Downloaded: https://repo.spongepowered.org/maven/org/spongepowered/spongeapi/7.0.0-SNAPSHOT/spongeapi-7.0.0-20170911.153654-37.pom (5 KB at 24.4 KB/sec)
Downloading: https://repo.spongepowered.org/maven/com/flowpowered/flow-noise/1.0.1-SNAPSHOT/maven-metadata.xml
Downloading: http://repo.citizensnpcs.co/com/flowpowered/flow-noise/1.0.1-SNAPSHOT/maven-metadata.xml
Downloaded: https://repo.spongepowered.org/maven/com/flowpowered/flow-noise/1.0.1-SNAPSHOT/maven-metadata.xml (361 B at 2.1 KB/sec)
Downloading: https://repo.spongepowered.org/maven/org/spongepowered/spongeapi/7.0.0-SNAPSHOT/spongeapi-7.0.0-20170911.153654-37.jar
Downloaded: https://repo.spongepowered.org/maven/org/spongepowered/spongeapi/7.0.0-SNAPSHOT/spongeapi-7.0.0-20170911.153654-37.jar (2000 KB at 1941.6 KB/sec)
[INFO] 
[INFO] --- maven-clean-plugin:2.4.1:clean (default-clean) @ denizen2sponge ---
[INFO] Deleting /var/lib/jenkins/jobs/Denizen2Sponge/workspace/target
[INFO] 
[INFO] --- templating-maven-plugin:1.0-alpha-3:filter-sources (filter-src) @ denizen2sponge ---
[INFO] Using 'UTF-8' encoding to copy filtered resources.
[INFO] Copying 1 resource
[INFO] Source directory: /var/lib/jenkins/jobs/Denizen2Sponge/workspace/target/generated-sources/java-templates added.
[INFO] 
[INFO] --- maven-resources-plugin:2.4.3:resources (default-resources) @ denizen2sponge ---
[INFO] Using 'UTF-8' encoding to copy filtered resources.
[INFO] Copying 1 resource to com/denizenscript/denizen2sponge
[INFO] Copying 1 resource
[INFO] 
[INFO] --- maven-compiler-plugin:2.3.2:compile (default-compile) @ denizen2sponge ---
[INFO] Compiling 116 source files to /var/lib/jenkins/jobs/Denizen2Sponge/workspace/target/classes
[INFO] -------------------------------------------------------------
[ERROR] COMPILATION ERROR : 
[INFO] -------------------------------------------------------------
[ERROR] /var/lib/jenkins/jobs/Denizen2Sponge/workspace/src/main/java/com/denizenscript/denizen2sponge/commands/entity/SpawnCommand.java:[19,53] error: cannot find symbol
[ERROR]  package org.spongepowered.api.event.cause.entity.spawn
/var/lib/jenkins/jobs/Denizen2Sponge/workspace/src/main/java/com/denizenscript/denizen2sponge/commands/entity/DropCommand.java:[24,53] error: cannot find symbol
[ERROR]  package org.spongepowered.api.event.cause.entity.spawn
/var/lib/jenkins/jobs/Denizen2Sponge/workspace/src/main/java/com/denizenscript/denizen2sponge/Denizen2Sponge.java:[38,40] error: cannot find symbol
[INFO] 3 errors 
[INFO] -------------------------------------------------------------
Started calculate disk usage of build
Finished Calculation of disk usage of build in 0 seconds
Started calculate disk usage of workspace
Finished Calculation of disk usage of workspace in 0 seconds
[INFO] ------------------------------------------------------------------------
[INFO] BUILD FAILURE
[INFO] ------------------------------------------------------------------------
[INFO] Total time: 10.441s
[INFO] Finished at: Fri Sep 15 18:13:22 GMT 2017
[INFO] Final Memory: 20M/116M
[INFO] ------------------------------------------------------------------------
Waiting for Jenkins to finish collecting data
[ERROR] Failed to execute goal org.apache.maven.plugins:maven-compiler-plugin:2.3.2:compile (default-compile) on project denizen2sponge: Compilation failure: Compilation failure:
[ERROR] /var/lib/jenkins/jobs/Denizen2Sponge/workspace/src/main/java/com/denizenscript/denizen2sponge/commands/entity/SpawnCommand.java:[19,53] error: cannot find symbol
[ERROR] package org.spongepowered.api.event.cause.entity.spawn
[ERROR] /var/lib/jenkins/jobs/Denizen2Sponge/workspace/src/main/java/com/denizenscript/denizen2sponge/commands/entity/DropCommand.java:[24,53] error: cannot find symbol
[ERROR] package org.spongepowered.api.event.cause.entity.spawn
[ERROR] /var/lib/jenkins/jobs/Denizen2Sponge/workspace/src/main/java/com/denizenscript/denizen2sponge/Denizen2Sponge.java:[38,40] error: cannot find symbol
[ERROR] -> [Help 1]
[ERROR] 
[ERROR] To see the full stack trace of the errors, re-run Maven with the -e switch.
[ERROR] Re-run Maven using the -X switch to enable full debug logging.
[ERROR] 
[ERROR] For more information about the errors and possible solutions, please read the following articles:
[ERROR] [Help 1] http://cwiki.apache.org/confluence/display/MAVEN/MojoFailureException
[JENKINS] Archiving /var/lib/jenkins/jobs/Denizen2Sponge/workspace/pom.xml to com.denizenscript/denizen2sponge/0.3.0/denizen2sponge-0.3.0.pom
Archiving artifacts
channel stopped
IRC notifier plugin: Sending notification to: #citizens
IRC notifier plugin: Sending notification to: #denizen-dev
IRC notifier plugin: Sending notification to: #citizens-dev
Started calculate disk usage of build
Finished Calculation of disk usage of build in 0 seconds
Started calculate disk usage of workspace
Finished Calculation of disk usage of workspace in 0 seconds
Finished: FAILURE