Skip to content
Success

Console Output

Started calculate disk usage of build
Finished Calculation of disk usage of build in 0 seconds
Started calculate disk usage of workspace
Finished Calculation of disk usage of workspace in 0 seconds
[INFO] 
[INFO] -----------------< net.citizensnpcs:citizens-v1_15_R1 >-----------------
[INFO] Building citizens-v1_15_R1 2.0.27-SNAPSHOT                        [9/11]
[INFO] --------------------------------[ jar ]---------------------------------
[INFO] 
[INFO] --- maven-clean-plugin:2.5:clean (default-clean) @ citizens-v1_15_R1 ---
[INFO] 
[INFO] --- maven-resources-plugin:2.6:resources (default-resources) @ citizens-v1_15_R1 ---
[INFO] Using 'UTF-8' encoding to copy filtered resources.
[INFO] skip non existing resourceDirectory /var/lib/jenkins/jobs/Citizens2/workspace/v1_15_R1/src/main/resources
[INFO] 
[INFO] --- maven-compiler-plugin:3.8.1:compile (default-compile) @ citizens-v1_15_R1 ---
[INFO] Changes detected - recompiling the module!
[INFO] 
[INFO] --- maven-resources-plugin:2.6:testResources (default-testResources) @ citizens-v1_15_R1 ---
[INFO] Using 'UTF-8' encoding to copy filtered resources.
[INFO] skip non existing resourceDirectory /var/lib/jenkins/jobs/Citizens2/workspace/v1_15_R1/src/test/resources
[INFO] 
[INFO] --- maven-compiler-plugin:3.8.1:testCompile (default-testCompile) @ citizens-v1_15_R1 ---
[INFO] No sources to compile
[INFO] 
[INFO] --- maven-surefire-plugin:2.12.4:test (default-test) @ citizens-v1_15_R1 ---
[INFO] No tests to run.
[JENKINS] Recording test results
[INFO] 
[INFO] --- maven-jar-plugin:3.2.0:jar (default-jar) @ citizens-v1_15_R1 ---
[INFO] Building jar: /var/lib/jenkins/jobs/Citizens2/workspace/v1_15_R1/target/citizens-v1_15_R1-2.0.27-SNAPSHOT.jar
[INFO] 
[INFO] --- maven-shade-plugin:3.2.1:shade (default) @ citizens-v1_15_R1 ---
[INFO] Replacing original artifact with shaded artifact.
[INFO] Replacing /var/lib/jenkins/jobs/Citizens2/workspace/v1_15_R1/target/citizens-v1_15_R1-2.0.27-SNAPSHOT.jar with /var/lib/jenkins/jobs/Citizens2/workspace/v1_15_R1/target/citizens-v1_15_R1-2.0.27-SNAPSHOT-shaded.jar
[INFO] 
[INFO] --- maven-resources-plugin:2.6:resources (default-resources) @ citizens-v1_15_R1 ---
[INFO] Using 'UTF-8' encoding to copy filtered resources.
[INFO] skip non existing resourceDirectory /var/lib/jenkins/jobs/Citizens2/workspace/v1_15_R1/src/main/resources
[INFO] 
[INFO] --- maven-compiler-plugin:3.8.1:compile (default-compile) @ citizens-v1_15_R1 ---
[INFO] Changes detected - recompiling the module!
[INFO] 
[INFO] --- maven-resources-plugin:2.6:testResources (default-testResources) @ citizens-v1_15_R1 ---
[INFO] Using 'UTF-8' encoding to copy filtered resources.
[INFO] skip non existing resourceDirectory /var/lib/jenkins/jobs/Citizens2/workspace/v1_15_R1/src/test/resources
[INFO] 
[INFO] --- maven-compiler-plugin:3.8.1:testCompile (default-testCompile) @ citizens-v1_15_R1 ---
[INFO] No sources to compile
[INFO] 
[INFO] --- maven-surefire-plugin:2.12.4:test (default-test) @ citizens-v1_15_R1 ---
[INFO] No tests to run.
[INFO] Skipping execution of surefire because it has already been run for this configuration
[JENKINS] Recording test results
[INFO] 
[INFO] --- maven-jar-plugin:3.2.0:jar (default-jar) @ citizens-v1_15_R1 ---
[INFO] Building jar: /var/lib/jenkins/jobs/Citizens2/workspace/v1_15_R1/target/citizens-v1_15_R1-2.0.27-SNAPSHOT.jar
[INFO] 
[INFO] --- maven-shade-plugin:3.2.1:shade (default) @ citizens-v1_15_R1 ---
[INFO] Replacing original artifact with shaded artifact.
[INFO] Replacing /var/lib/jenkins/jobs/Citizens2/workspace/v1_15_R1/target/citizens-v1_15_R1-2.0.27-SNAPSHOT.jar with /var/lib/jenkins/jobs/Citizens2/workspace/v1_15_R1/target/citizens-v1_15_R1-2.0.27-SNAPSHOT-shaded.jar
[INFO] 
[INFO] --- maven-install-plugin:2.4:install (default-install) @ citizens-v1_15_R1 ---
[INFO] Installing /var/lib/jenkins/jobs/Citizens2/workspace/v1_15_R1/target/citizens-v1_15_R1-2.0.27-SNAPSHOT.jar to /var/lib/jenkins/.m2/repository/net/citizensnpcs/citizens-v1_15_R1/2.0.27-SNAPSHOT/citizens-v1_15_R1-2.0.27-SNAPSHOT.jar
[INFO] Installing /var/lib/jenkins/jobs/Citizens2/workspace/v1_15_R1/pom.xml to /var/lib/jenkins/.m2/repository/net/citizensnpcs/citizens-v1_15_R1/2.0.27-SNAPSHOT/citizens-v1_15_R1-2.0.27-SNAPSHOT.pom
Started calculate disk usage of build
Finished Calculation of disk usage of build in 0 seconds
Started calculate disk usage of workspace
Finished Calculation of disk usage of workspace in 0 seconds
[INFO] ------------------------------------------------------------------------
[INFO] Reactor Summary for citizens-parent 2.0.27-SNAPSHOT:
[INFO] 
[INFO] citizens-parent .................................... SUCCESS [  1.047 s]
[INFO] citizens-main ...................................... SUCCESS [ 16.809 s]
[INFO] citizens-v1_8_R3 ................................... SUCCESS [  4.470 s]
[INFO] citizens-v1_10_R1 .................................. SUCCESS [  8.687 s]
[INFO] citizens-v1_11_R1 .................................. SUCCESS [  9.318 s]
[INFO] citizens-v1_12_R1 .................................. SUCCESS [ 11.378 s]
[INFO] citizens-v1_13_R2 .................................. SUCCESS [ 11.137 s]
[INFO] citizens-v1_14_R1 .................................. SUCCESS [ 17.256 s]
[INFO] citizens-v1_15_R1 .................................. SUCCESS [ 14.496 s]
[INFO] citizens-v1_16_R3 .................................. FAILURE [  2.765 s]
[INFO] citizens ........................................... SKIPPED
[INFO] ------------------------------------------------------------------------
[INFO] BUILD FAILURE
[INFO] ------------------------------------------------------------------------
[INFO] Total time:  01:43 min
[INFO] Finished at: 2020-12-21T03:10:52Z
[INFO] ------------------------------------------------------------------------
[ERROR] Failed to execute goal org.apache.maven.plugins:maven-compiler-plugin:3.8.1:compile (default-compile) on project citizens-v1_16_R3: Compilation failure: Compilation failure:
[ERROR] [ecj] The compiler reported an error but has not written it to its logging
[ERROR] [ecj] The following line(s) might indicate the issue:
[ERROR] String ret = CraftSound.getSound(Sound.valueOf(flag.toUpperCase()));
[ERROR] ^^^^^^^^
[ERROR] The method getSound(Sound) is undefined for the type CraftSound
[ERROR] ----------
[ERROR] 1 problem (1 error)
[ERROR] -> [Help 1]
[ERROR] 
[ERROR] To see the full stack trace of the errors, re-run Maven with the -e switch.
[ERROR] Re-run Maven using the -X switch to enable full debug logging.
[ERROR] 
[ERROR] For more information about the errors and possible solutions, please read the following articles:
[ERROR] [Help 1] http://cwiki.apache.org/confluence/display/MAVEN/MojoFailureException
[ERROR] 
[ERROR] After correcting the problems, you can resume the build with the command
[ERROR]   mvn <goals> -rf :citizens-v1_16_R3
Waiting for Jenkins to finish collecting data