FailedConsole Output

Started by GitHub push by fullwall
Building in workspace /var/lib/jenkins/jobs/CitizensAPI/workspace
No credentials specified
Wiping out workspace first.
Cloning the remote Git repository
Cloning repository git://github.com/CitizensDev/CitizensAPI.git
 > git init /var/lib/jenkins/jobs/CitizensAPI/workspace # timeout=10
Fetching upstream changes from git://github.com/CitizensDev/CitizensAPI.git
 > git --version # timeout=10
 > git fetch --tags --progress git://github.com/CitizensDev/CitizensAPI.git +refs/heads/*:refs/remotes/origin/*
 > git config remote.origin.url git://github.com/CitizensDev/CitizensAPI.git # timeout=10
 > git config --add remote.origin.fetch +refs/heads/*:refs/remotes/origin/* # timeout=10
 > git config remote.origin.url git://github.com/CitizensDev/CitizensAPI.git # timeout=10
Fetching upstream changes from git://github.com/CitizensDev/CitizensAPI.git
 > git fetch --tags --progress git://github.com/CitizensDev/CitizensAPI.git +refs/heads/*:refs/remotes/origin/*
Seen branch in repository origin/compat
Seen branch in repository origin/master
Seen branch in repository origin/simplify
Seen branch in repository origin/speech
Seen 4 remote branches
 > git show-ref --tags -d # timeout=10
Checking out Revision ce8f291bd2e25b6dac56cfea9e018784f57920e3 (origin/master)
 > git config core.sparsecheckout # timeout=10
 > git checkout -f ce8f291bd2e25b6dac56cfea9e018784f57920e3
Commit message: "Update pom"
 > git rev-list --no-walk f0691a31c4c7563e8beb545237d19ded5ced682c # timeout=10
 > git tag -a -f -m Jenkins Build #598 jenkins-CitizensAPI-598 # timeout=10
Parsing POMs
Modules changed, recalculating dependency graph
Established TCP socket on 43242
[workspace] $ /var/lib/jenkins/tools/hudson.model.JDK/JDK8/bin/java -Djava.awt.headless=true -Djava.awt.headless=true -cp /var/lib/jenkins/plugins/maven-plugin/WEB-INF/lib/maven3-agent-1.12.jar:/var/lib/jenkins/tools/hudson.tasks.Maven_MavenInstallation/Maven_3.0.3/boot/plexus-classworlds-2.4.jar org.jvnet.hudson.maven3.agent.Maven3Main /var/lib/jenkins/tools/hudson.tasks.Maven_MavenInstallation/Maven_3.0.3 /var/cache/jenkins/war/WEB-INF/lib/remoting-3.29.jar /var/lib/jenkins/plugins/maven-plugin/WEB-INF/lib/maven3-interceptor-1.12.jar /var/lib/jenkins/plugins/maven-plugin/WEB-INF/lib/maven3-interceptor-commons-1.12.jar 43242
<===[JENKINS REMOTING CAPACITY]===>channel started
Executing Maven:  -B -f /var/lib/jenkins/jobs/CitizensAPI/workspace/pom.xml -amd -pl net.citizensnpcs:citizensapi clean install javadoc:javadoc
[INFO] Scanning for projects...
[HUDSON] Collecting dependencies info
[INFO]                                                                         
[INFO] ------------------------------------------------------------------------
[INFO] Building CitizensAPI 2.0.25-SNAPSHOT
[INFO] ------------------------------------------------------------------------
Downloading: http://repo.bukkit.org/content/groups/public/org/bukkit/bukkit/1.14.1-R0.1-SNAPSHOT/maven-metadata.xml
[WARNING] Could not transfer metadata org.bukkit:bukkit:1.14.1-R0.1-SNAPSHOT/maven-metadata.xml from/to bukkit-repo (http://repo.bukkit.org/content/groups/public/): Error transferring file: repo.bukkit.org
Downloading: http://repo.bukkit.org/content/groups/public/org/bukkit/bukkit/1.14.1-R0.1-SNAPSHOT/maven-metadata.xml
[WARNING] Could not transfer metadata org.bukkit:bukkit:1.14.1-R0.1-SNAPSHOT/maven-metadata.xml from/to bukkit-repo (http://repo.bukkit.org/content/groups/public/): Error transferring file: repo.bukkit.org
Downloading: http://repo.bukkit.org/content/groups/public/org/bukkit/bukkit/1.14.1-R0.1-SNAPSHOT/bukkit-1.14.1-R0.1-SNAPSHOT.pom
[WARNING] Attempt to (de-)serialize anonymous class org.jfrog.hudson.maven2.MavenDependenciesRecorder$1; see: https://jenkins.io/redirect/serialization-of-anonymous-classes/
Started calculate disk usage of build
Finished Calculation of disk usage of build in 0 seconds
Started calculate disk usage of workspace
Finished Calculation of disk usage of workspace in 0 seconds
[INFO] ------------------------------------------------------------------------
[INFO] BUILD FAILURE
[INFO] ------------------------------------------------------------------------
[INFO] Total time: 1.184s
[INFO] Finished at: Tue May 14 08:44:58 UTC 2019
[INFO] Final Memory: 14M/105M
[INFO] ------------------------------------------------------------------------
Waiting for Jenkins to finish collecting data
[JENKINS] Archiving /var/lib/jenkins/jobs/CitizensAPI/workspace/pom.xml to net.citizensnpcs/citizensapi/2.0.25-SNAPSHOT/citizensapi-2.0.25-SNAPSHOT.pom
[ERROR] Failed to execute goal on project citizensapi: Could not resolve dependencies for project net.citizensnpcs:citizensapi:jar:2.0.25-SNAPSHOT: Failed to collect dependencies for [org.bukkit:bukkit:jar:1.14.1-R0.1-SNAPSHOT (provided), org.powermock:powermock-module-junit4:jar:1.4.12 (test), org.powermock:powermock-api-mockito:jar:1.4.12 (test)]: Failed to read artifact descriptor for org.bukkit:bukkit:jar:1.14.1-R0.1-SNAPSHOT: Could not transfer artifact org.bukkit:bukkit:pom:1.14.1-R0.1-SNAPSHOT from/to bukkit-repo (http://repo.bukkit.org/content/groups/public/): Error transferring file: repo.bukkit.org: Unknown host repo.bukkit.org -> [Help 1]
[ERROR] 
[ERROR] To see the full stack trace of the errors, re-run Maven with the -e switch.
[ERROR] Re-run Maven using the -X switch to enable full debug logging.
[ERROR] 
[ERROR] For more information about the errors and possible solutions, please read the following articles:
[ERROR] [Help 1] http://cwiki.apache.org/confluence/display/MAVEN/DependencyResolutionException
channel stopped
Archiving artifacts
IRC notifier plugin: Sending notification to: #citizens
IRC notifier plugin: [ERROR] not connected. Cannot send message to '#citizens'
IRC notifier plugin: Sending notification to: #citizens-dev
IRC notifier plugin: [ERROR] not connected. Cannot send message to '#citizens-dev'
IRC notifier plugin: Sending notification to: #denizen-dev
IRC notifier plugin: [ERROR] not connected. Cannot send message to '#denizen-dev'
[Set GitHub commit status (universal)] ERROR on repos [[email protected][description=API for Citizens,homepage=citizensnpcs.co,name=CitizensAPI,fork=false,archived=false,size=11200,milestones={},language=Java,commits={},source=<null>,parent=<null>,responseHeaderFields={null=[HTTP/1.1 200 OK], Access-Control-Allow-Origin=[*], Access-Control-Expose-Headers=[ETag, Link, Location, Retry-After, X-GitHub-OTP, X-RateLimit-Limit, X-RateLimit-Remaining, X-RateLimit-Reset, X-OAuth-Scopes, X-Accepted-OAuth-Scopes, X-Poll-Interval, X-GitHub-Media-Type], Cache-Control=[private, max-age=60, s-maxage=60], Content-Encoding=[gzip], Content-Security-Policy=[default-src 'none'], Content-Type=[application/json; charset=utf-8], Date=[Tue, 14 May 2019 08:44:59 GMT], ETag=[W/"4aa01dc3b1fe01120b7221c7e9469e01"], Last-Modified=[Tue, 14 May 2019 08:44:46 GMT], OkHttp-Received-Millis=[1557823499489], OkHttp-Response-Source=[CONDITIONAL_CACHE 200], OkHttp-Selected-Protocol=[http/1.1], OkHttp-Sent-Millis=[1557823499262], Referrer-Policy=[origin-when-cross-origin, strict-origin-when-cross-origin], Server=[GitHub.com], Status=[200 OK], Strict-Transport-Security=[max-age=31536000; includeSubdomains; preload], Transfer-Encoding=[chunked], Vary=[Accept, Authorization, Cookie, X-GitHub-OTP, Accept-Encoding], X-Accepted-OAuth-Scopes=[repo], X-Content-Type-Options=[nosniff], X-Frame-Options=[deny], X-GitHub-Media-Type=[github.v3; format=json], X-GitHub-Request-Id=[ED0C:5713:8603E4:A3B789:5CDA800B], X-OAuth-Scopes=[public_repo, repo:status], X-RateLimit-Limit=[5000], X-RateLimit-Remaining=[4999], X-RateLimit-Reset=[1557827099], X-XSS-Protection=[1; mode=block]},url=https://api.github.com/repos/CitizensDev/CitizensAPI,id=3343190]] (sha:ce8f291) with context:ci/jenkins/build-status
Setting commit status on GitHub for https://github.com/CitizensDev/CitizensAPI/commit/ce8f291bd2e25b6dac56cfea9e018784f57920e3
Started calculate disk usage of build
Finished Calculation of disk usage of build in 0 seconds
Started calculate disk usage of workspace
Finished Calculation of disk usage of workspace in 0 seconds
Sending notification to Discord.
Finished: FAILURE