Skip to content
Failed

Console Output

Started by GitHub push by fullwall
Running as SYSTEM
Building in workspace /var/lib/jenkins/jobs/Citizens2/workspace
No credentials specified
Wiping out workspace first.
Cloning the remote Git repository
Cloning repository git://github.com/CitizensDev/Citizens2.git
 > git init /var/lib/jenkins/jobs/Citizens2/workspace # timeout=10
Fetching upstream changes from git://github.com/CitizensDev/Citizens2.git
 > git --version # timeout=10
 > git fetch --tags --progress git://github.com/CitizensDev/Citizens2.git +refs/heads/*:refs/remotes/origin/* # timeout=10
 > git config remote.origin.url git://github.com/CitizensDev/Citizens2.git # timeout=10
 > git config --add remote.origin.fetch +refs/heads/*:refs/remotes/origin/* # timeout=10
 > git config remote.origin.url git://github.com/CitizensDev/Citizens2.git # timeout=10
Fetching upstream changes from git://github.com/CitizensDev/Citizens2.git
 > git fetch --tags --progress git://github.com/CitizensDev/Citizens2.git +refs/heads/*:refs/remotes/origin/* # timeout=10
 > git rev-parse origin/master^{commit} # timeout=10
Checking out Revision c72016046be8d8eaed4f2d14851272157ea473dc (origin/master)
 > git config core.sparsecheckout # timeout=10
 > git checkout -f c72016046be8d8eaed4f2d14851272157ea473dc # timeout=10
Commit message: "Fix player movement speed and add iterations per tick setting for new pathfinder"
 > git rev-list --no-walk e1f749236b8d10eff83178752d2e8620477996c5 # timeout=10
 > git tag -a -f -m Jenkins Build #1936 jenkins-Citizens2-1936 # timeout=10
false
xasfewrhet
Parsing POMs
Modules changed, recalculating dependency graph
Established TCP socket on 35547
[workspace] $ /var/lib/jenkins/tools/hudson.model.JDK/JDK8/bin/java -Djava.awt.headless=true -Djava.awt.headless=true -cp /var/lib/jenkins/plugins/maven-plugin/WEB-INF/lib/maven35-agent-1.13.jar:/var/lib/jenkins/tools/hudson.tasks.Maven_MavenInstallation/Maven_3.6.3/boot/plexus-classworlds-2.6.0.jar:/var/lib/jenkins/tools/hudson.tasks.Maven_MavenInstallation/Maven_3.6.3/conf/logging jenkins.maven3.agent.Maven35Main /var/lib/jenkins/tools/hudson.tasks.Maven_MavenInstallation/Maven_3.6.3 /var/cache/jenkins/war/WEB-INF/lib/remoting-4.2.jar /var/lib/jenkins/plugins/maven-plugin/WEB-INF/lib/maven35-interceptor-1.13.jar /var/lib/jenkins/plugins/maven-plugin/WEB-INF/lib/maven3-interceptor-commons-1.13.jar 35547
<===[JENKINS REMOTING CAPACITY]===>channel started
Executing Maven:  -B -f /var/lib/jenkins/jobs/Citizens2/workspace/pom.xml clean package install javadoc:javadoc -DBUILD_NUMBER=1936
[INFO] Scanning for projects...
[INFO] ------------------------------------------------------------------------
[INFO] Reactor Build Order:
[INFO] 
[INFO] citizens-parent                                                    [pom]
[INFO] citizens-main                                                      [jar]
[INFO] citizens-v1_8_R3                                                   [jar]
[INFO] citizens-v1_10_R1                                                  [jar]
[INFO] citizens-v1_11_R1                                                  [jar]
[INFO] citizens-v1_12_R1                                                  [jar]
[INFO] citizens-v1_13_R2                                                  [jar]
[INFO] citizens-v1_14_R1                                                  [jar]
[INFO] citizens-v1_15_R1                                                  [jar]
[INFO] citizens                                                           [pom]
[INFO] 
[INFO] ------------------< net.citizensnpcs:citizens-parent >------------------
[INFO] Building citizens-parent 2.0.26-SNAPSHOT                          [1/10]
[INFO] --------------------------------[ pom ]---------------------------------
[INFO] 
[INFO] --- maven-clean-plugin:2.5:clean (default-clean) @ citizens-parent ---
[INFO] 
[INFO] --- maven-install-plugin:2.4:install (default-install) @ citizens-parent ---
[INFO] Installing /var/lib/jenkins/jobs/Citizens2/workspace/pom.xml to /var/lib/jenkins/.m2/repository/net/citizensnpcs/citizens-parent/2.0.26-SNAPSHOT/citizens-parent-2.0.26-SNAPSHOT.pom
[INFO] 
[INFO] >>> maven-javadoc-plugin:2.10.1:javadoc (default-cli) > generate-sources @ citizens-parent >>>
[WARNING] Failed to getClass for org.apache.maven.plugin.javadoc.JavadocReport
[INFO] 
[INFO] <<< maven-javadoc-plugin:2.10.1:javadoc (default-cli) < generate-sources @ citizens-parent <<<
[INFO] 
[INFO] 
[INFO] --- maven-javadoc-plugin:2.10.1:javadoc (default-cli) @ citizens-parent ---
Started calculate disk usage of build
Finished Calculation of disk usage of build in 0 seconds
Started calculate disk usage of workspace
Finished Calculation of disk usage of workspace in 0 seconds
[INFO] 
[INFO] -------------------< net.citizensnpcs:citizens-main >-------------------
[INFO] Building citizens-main 2.0.26-SNAPSHOT                            [2/10]
[INFO] --------------------------------[ jar ]---------------------------------
[INFO] Downloading from spigot-repo: https://hub.spigotmc.org/nexus/content/repositories/snapshots/org/bstats/bstats-bukkit/1.7/bstats-bukkit-1.7.pom
[INFO] Downloading from everything: http://repo.citizensnpcs.co/org/bstats/bstats-bukkit/1.7/bstats-bukkit-1.7.pom
[INFO] Downloading from CodeMC: https://repo.codemc.org/repository/maven-public/org/bstats/bstats-bukkit/1.7/bstats-bukkit-1.7.pom
[INFO] Downloaded from CodeMC: https://repo.codemc.org/repository/maven-public/org/bstats/bstats-bukkit/1.7/bstats-bukkit-1.7.pom (953 B at 724 B/s)
[INFO] Downloading from spigot-repo: https://hub.spigotmc.org/nexus/content/repositories/snapshots/org/bstats/bstats/1.7/bstats-1.7.pom
[INFO] Downloading from everything: http://repo.citizensnpcs.co/org/bstats/bstats/1.7/bstats-1.7.pom
[INFO] Downloading from CodeMC: https://repo.codemc.org/repository/maven-public/org/bstats/bstats/1.7/bstats-1.7.pom
[INFO] Downloaded from CodeMC: https://repo.codemc.org/repository/maven-public/org/bstats/bstats/1.7/bstats-1.7.pom (7.3 kB at 9.0 kB/s)
[INFO] Downloading from spigot-repo: https://hub.spigotmc.org/nexus/content/repositories/snapshots/org/bstats/bstats-bukkit/1.7/bstats-bukkit-1.7.jar
[INFO] Downloading from everything: http://repo.citizensnpcs.co/org/bstats/bstats-bukkit/1.7/bstats-bukkit-1.7.jar
[INFO] Downloading from CodeMC: https://repo.codemc.org/repository/maven-public/org/bstats/bstats-bukkit/1.7/bstats-bukkit-1.7.jar
[INFO] Downloaded from CodeMC: https://repo.codemc.org/repository/maven-public/org/bstats/bstats-bukkit/1.7/bstats-bukkit-1.7.jar (20 kB at 21 kB/s)
[INFO] 
[INFO] --- maven-clean-plugin:2.5:clean (default-clean) @ citizens-main ---
[INFO] 
[INFO] --- maven-resources-plugin:2.6:resources (default-resources) @ citizens-main ---
[INFO] Using 'UTF-8' encoding to copy filtered resources.
[INFO] Copying 7 resources to .
[INFO] 
[INFO] --- maven-compiler-plugin:3.8.1:compile (default-compile) @ citizens-main ---
[INFO] Changes detected - recompiling the module!
[INFO] Compiling 136 source files to /var/lib/jenkins/jobs/Citizens2/workspace/main/target/classes
[INFO] /var/lib/jenkins/jobs/Citizens2/workspace/main/src/main/java/net/citizensnpcs/trait/versioned/CatTrait.java: Some input files use or override a deprecated API.
[INFO] /var/lib/jenkins/jobs/Citizens2/workspace/main/src/main/java/net/citizensnpcs/trait/versioned/CatTrait.java: Recompile with -Xlint:deprecation for details.
[INFO] -------------------------------------------------------------
[ERROR] COMPILATION ERROR : 
[INFO] -------------------------------------------------------------
[ERROR] /var/lib/jenkins/jobs/Citizens2/workspace/main/src/main/java/net/citizensnpcs/npc/ai/AStarNavigationStrategy.java:[118,26] cannot find symbol
  symbol:   method isEmpty()
  location: variable state of type net.citizensnpcs.api.astar.AStarMachine<net.citizensnpcs.api.astar.pathfinder.VectorNode,net.citizensnpcs.api.astar.pathfinder.Path>.AStarState
[INFO] 1 error
[INFO] -------------------------------------------------------------
Started calculate disk usage of build
Finished Calculation of disk usage of build in 0 seconds
Started calculate disk usage of workspace
Finished Calculation of disk usage of workspace in 0 seconds
[INFO] ------------------------------------------------------------------------
[INFO] Reactor Summary for citizens-parent 2.0.26-SNAPSHOT:
[INFO] 
[INFO] citizens-parent .................................... SUCCESS [  2.439 s]
[INFO] citizens-main ...................................... FAILURE [ 19.075 s]
[INFO] citizens-v1_8_R3 ................................... SKIPPED
[INFO] citizens-v1_10_R1 .................................. SKIPPED
[INFO] citizens-v1_11_R1 .................................. SKIPPED
[INFO] citizens-v1_12_R1 .................................. SKIPPED
[INFO] citizens-v1_13_R2 .................................. SKIPPED
[INFO] citizens-v1_14_R1 .................................. SKIPPED
[INFO] citizens-v1_15_R1 .................................. SKIPPED
[INFO] citizens ........................................... SKIPPED
[INFO] ------------------------------------------------------------------------
[INFO] BUILD FAILURE
[INFO] ------------------------------------------------------------------------
[INFO] Total time:  24.882 s
[INFO] Finished at: 2020-05-06T10:09:38Z
[INFO] ------------------------------------------------------------------------
Waiting for Jenkins to finish collecting data[ERROR] Failed to execute goal org.apache.maven.plugins:maven-compiler-plugin:3.8.1:compile (default-compile) on project citizens-main: Compilation failure
[ERROR] /var/lib/jenkins/jobs/Citizens2/workspace/main/src/main/java/net/citizensnpcs/npc/ai/AStarNavigationStrategy.java:[118,26] cannot find symbol
[ERROR] symbol:   method isEmpty()
[ERROR] location: variable state of type net.citizensnpcs.api.astar.AStarMachine<net.citizensnpcs.api.astar.pathfinder.VectorNode,net.citizensnpcs.api.astar.pathfinder.Path>.AStarState
[ERROR] -> [Help 1]
[ERROR] 
[ERROR] To see the full stack trace of the errors, re-run Maven with the -e switch.
[ERROR] Re-run Maven using the -X switch to enable full debug logging.
[ERROR] 
[ERROR] For more information about the errors and possible solutions, please read the following articles:
[ERROR] [Help 1] http://cwiki.apache.org/confluence/display/MAVEN/MojoFailureException
[ERROR] 
[ERROR] After correcting the problems, you can resume the build with the command
[ERROR]   mvn <goals> -rf :citizens-main

[JENKINS] Archiving /var/lib/jenkins/jobs/Citizens2/workspace/v1_15_R1/pom.xml to net.citizensnpcs/citizens-v1_15_R1/2.0.26-SNAPSHOT/citizens-v1_15_R1-2.0.26-SNAPSHOT.pom
[JENKINS] Archiving /var/lib/jenkins/jobs/Citizens2/workspace/dist/pom.xml to net.citizensnpcs/citizens/2.0.26-SNAPSHOT/citizens-2.0.26-SNAPSHOT.pom
[JENKINS] Archiving /var/lib/jenkins/jobs/Citizens2/workspace/main/pom.xml to net.citizensnpcs/citizens-main/2.0.26-SNAPSHOT/citizens-main-2.0.26-SNAPSHOT.pom
[JENKINS] Archiving /var/lib/jenkins/jobs/Citizens2/workspace/v1_14_R1/pom.xml to net.citizensnpcs/citizens-v1_14_R1/2.0.26-SNAPSHOT/citizens-v1_14_R1-2.0.26-SNAPSHOT.pom
[JENKINS] Archiving /var/lib/jenkins/jobs/Citizens2/workspace/v1_11_R1/pom.xml to net.citizensnpcs/citizens-v1_11_R1/2.0.26-SNAPSHOT/citizens-v1_11_R1-2.0.26-SNAPSHOT.pom
[JENKINS] Archiving /var/lib/jenkins/jobs/Citizens2/workspace/v1_8_R3/pom.xml to net.citizensnpcs/citizens-v1_8_R3/2.0.26-SNAPSHOT/citizens-v1_8_R3-2.0.26-SNAPSHOT.pom
[JENKINS] Archiving /var/lib/jenkins/jobs/Citizens2/workspace/v1_10_R1/pom.xml to net.citizensnpcs/citizens-v1_10_R1/2.0.26-SNAPSHOT/citizens-v1_10_R1-2.0.26-SNAPSHOT.pom
[JENKINS] Archiving /var/lib/jenkins/jobs/Citizens2/workspace/v1_12_R1/pom.xml to net.citizensnpcs/citizens-v1_12_R1/2.0.26-SNAPSHOT/citizens-v1_12_R1-2.0.26-SNAPSHOT.pom
[JENKINS] Archiving /var/lib/jenkins/jobs/Citizens2/workspace/v1_13_R2/pom.xml to net.citizensnpcs/citizens-v1_13_R2/2.0.26-SNAPSHOT/citizens-v1_13_R2-2.0.26-SNAPSHOT.pom
[JENKINS] Archiving /var/lib/jenkins/jobs/Citizens2/workspace/pom.xml to net.citizensnpcs/citizens-parent/2.0.26-SNAPSHOT/citizens-parent-2.0.26-SNAPSHOT.pom
channel stopped
Archiving artifacts
[Set GitHub commit status (universal)] ERROR on repos [GHRepository@31f9883[nodeId=MDEwOlJlcG9zaXRvcnkzNDcyMTg3,description=Citizens - the premier plugin and API for creating server-side NPCs in Minecraft.,homepage=https://citizensnpcs.co,name=Citizens2,fork=false,archived=false,size=61032,milestones={},language=Java,commits={},source=<null>,parent=<null>,url=https://api.github.com/repos/CitizensDev/Citizens2,id=3472187]] (sha:c720160) with context:ci/jenkins/build-status
Setting commit status on GitHub for https://github.com/CitizensDev/Citizens2/commit/c72016046be8d8eaed4f2d14851272157ea473dc
Started calculate disk usage of build
Finished Calculation of disk usage of build in 0 seconds
Started calculate disk usage of workspace
Finished Calculation of disk usage of workspace in 0 seconds
Sending notification to Discord.
Finished: FAILURE