Console Output

Started by GitHub push by fullwall
Started by upstream project "CitizensAPI" build number 874
originally caused by:
 Started by GitHub push by fullwall
Started by upstream project "CitizensAPI" build number 874
originally caused by:
 Started by GitHub push by fullwall
Running as SYSTEM
Building in workspace /var/lib/jenkins/jobs/Citizens2/workspace
The recommended git tool is: NONE
No credentials specified
Wiping out workspace first.
Cloning the remote Git repository
Cloning repository https://github.com/CitizensDev/Citizens2.git
 > git init /var/lib/jenkins/jobs/Citizens2/workspace # timeout=10
Fetching upstream changes from https://github.com/CitizensDev/Citizens2.git
 > git --version # timeout=10
 > git --version # 'git version 1.8.3.1'
 > git fetch --tags --progress https://github.com/CitizensDev/Citizens2.git +refs/heads/*:refs/remotes/origin/* # timeout=10
 > git config remote.origin.url https://github.com/CitizensDev/Citizens2.git # timeout=10
 > git config --add remote.origin.fetch +refs/heads/*:refs/remotes/origin/* # timeout=10
Avoid second fetch
 > git rev-parse origin/master^{commit} # timeout=10
Checking out Revision e9d197eab0f2cb0c071927235a49cefdb90e7a82 (origin/master)
 > git config core.sparsecheckout # timeout=10
 > git checkout -f e9d197eab0f2cb0c071927235a49cefdb90e7a82 # timeout=10
Commit message: "Simplify navigator interface"
 > git rev-list --no-walk 7b3c0c8126efe6b0b0f3fb6001da9a5b726889cf # timeout=10
 > git tag -a -f -m Jenkins Build #2647 jenkins-Citizens2-2647 # timeout=10
false
Parsing POMs
Failed to transfer Could not find metadata org.spigotmc:spigot:1.19.1-R0.1-SNAPSHOT/maven-metadata.xml in everything (https://repo.citizensnpcs.co)
Failed to transfer Could not find metadata org.spigotmc:spigot:1.19.1-R0.1-SNAPSHOT/maven-metadata.xml in placeholderapi (https://repo.extendedclip.com/content/repositories/placeholderapi/)
Failed to transfer Could not find metadata org.spigotmc:spigot:1.19.1-R0.1-SNAPSHOT/maven-metadata.xml in spigot-repo (https://hub.spigotmc.org/nexus/content/repositories/snapshots/)
Failed to transfer Could not find metadata org.spigotmc:spigot:1.19.1-R0.1-SNAPSHOT/maven-metadata.xml in sk89q-repo (https://maven.enginehub.org/repo/)
Failed to transfer Could not find artifact org.spigotmc:spigot:pom:1.19.1-R0.1-SNAPSHOT in spigot-repo (https://hub.spigotmc.org/nexus/content/repositories/snapshots/)
Failed to transfer Could not find artifact org.spigotmc:spigot:pom:1.19.1-R0.1-SNAPSHOT in everything (https://repo.citizensnpcs.co)
Failed to transfer Could not find artifact org.spigotmc:spigot:pom:1.19.1-R0.1-SNAPSHOT in placeholderapi (https://repo.extendedclip.com/content/repositories/placeholderapi/)
Failed to transfer Could not find artifact org.spigotmc:spigot:pom:1.19.1-R0.1-SNAPSHOT in sk89q-repo (https://maven.enginehub.org/repo/)
Failed to transfer Could not find metadata org.bukkit:bukkit:1.13.1-R0.1-SNAPSHOT/maven-metadata.xml in everything (https://repo.citizensnpcs.co)
Failed to transfer Could not find metadata org.bukkit:bukkit:1.13.1-R0.1-SNAPSHOT/maven-metadata.xml in placeholderapi (https://repo.extendedclip.com/content/repositories/placeholderapi/)
Downloaded artifact https://hub.spigotmc.org/nexus/content/repositories/snapshots/org/bukkit/bukkit/1.13.1-R0.1-SNAPSHOT/maven-metadata.xml
Downloaded artifact https://maven.enginehub.org/repo/org/bukkit/bukkit/1.13.1-R0.1-SNAPSHOT/maven-metadata.xml
Downloaded artifact https://hub.spigotmc.org/nexus/content/repositories/snapshots/org/spigotmc/spigot-api/1.16.2-R0.1-SNAPSHOT/maven-metadata.xml
Failed to transfer Could not find metadata org.spigotmc:spigot-api:1.16.2-R0.1-SNAPSHOT/maven-metadata.xml in everything (https://repo.citizensnpcs.co)
Failed to transfer Could not find metadata com.sk89q.worldedit:worldedit-bukkit:7.2.0-SNAPSHOT/maven-metadata.xml in spigot-repo (https://hub.spigotmc.org/nexus/content/repositories/snapshots/)
Failed to transfer Could not find metadata com.sk89q.worldedit:worldedit-bukkit:7.2.0-SNAPSHOT/maven-metadata.xml in everything (https://repo.citizensnpcs.co)
Failed to transfer Could not find metadata com.sk89q.worldedit:worldedit-core:7.2.0-SNAPSHOT/maven-metadata.xml in spigot-repo (https://hub.spigotmc.org/nexus/content/repositories/snapshots/)
Failed to transfer Could not find metadata com.sk89q.worldedit:worldedit-core:7.2.0-SNAPSHOT/maven-metadata.xml in everything (https://repo.citizensnpcs.co)
Failed to transfer Could not find metadata com.sk89q.worldedit.worldedit-libs:core:7.2.0-SNAPSHOT/maven-metadata.xml in spigot-repo (https://hub.spigotmc.org/nexus/content/repositories/snapshots/)
Failed to transfer Could not find metadata com.sk89q.worldedit.worldedit-libs:core:7.2.0-SNAPSHOT/maven-metadata.xml in everything (https://repo.citizensnpcs.co)
Failed to transfer Could not find artifact org.spigotmc:spigot:jar:1.19.1-R0.1-SNAPSHOT in spigot-repo (https://hub.spigotmc.org/nexus/content/repositories/snapshots/)
Failed to transfer Could not find artifact org.spigotmc:spigot:jar:1.19.1-R0.1-SNAPSHOT in everything (https://repo.citizensnpcs.co)
Failed to transfer Could not find artifact org.spigotmc:spigot:jar:1.19.1-R0.1-SNAPSHOT in placeholderapi (https://repo.extendedclip.com/content/repositories/placeholderapi/)
Failed to transfer Could not find artifact org.spigotmc:spigot:jar:1.19.1-R0.1-SNAPSHOT in sk89q-repo (https://maven.enginehub.org/repo/)
Downloaded artifact https://repo.citizensnpcs.co/net/citizensnpcs/citizens-main/2.0.30-SNAPSHOT/maven-metadata.xml
Downloaded artifact https://repo.citizensnpcs.co/net/citizensnpcs/citizens-main/2.0.30-SNAPSHOT/citizens-main-2.0.30-20220727.223723-2646.pom
Downloaded artifact https://repo.citizensnpcs.co/net/citizensnpcs/citizens-parent/2.0.30-SNAPSHOT/maven-metadata.xml
Failed to transfer Could not find metadata net.citizensnpcs:citizens-parent:2.0.30-SNAPSHOT/maven-metadata.xml in placeholderapi (https://repo.extendedclip.com/content/repositories/placeholderapi/)
Failed to transfer Could not find metadata net.citizensnpcs:citizens-parent:2.0.30-SNAPSHOT/maven-metadata.xml in spigot-repo (https://hub.spigotmc.org/nexus/content/repositories/snapshots/)
Failed to transfer Could not find metadata net.citizensnpcs:citizens-parent:2.0.30-SNAPSHOT/maven-metadata.xml in sk89q-repo (https://maven.enginehub.org/repo/)
Failed to transfer Could not find metadata org.bukkit:craftbukkit:1.8.8-R0.1-SNAPSHOT/maven-metadata.xml in everything (https://repo.citizensnpcs.co)
Failed to transfer Could not find metadata org.bukkit:craftbukkit:1.12.2-R0.1-SNAPSHOT/maven-metadata.xml in everything (https://repo.citizensnpcs.co)
Failed to transfer Could not find metadata org.spigotmc:spigot:1.16.5-R0.1-SNAPSHOT/maven-metadata.xml in everything (https://repo.citizensnpcs.co)
Failed to transfer Could not find metadata org.spigotmc:spigot-parent:dev-SNAPSHOT/maven-metadata.xml in everything (https://repo.citizensnpcs.co)
Failed to transfer Could not find metadata org.spigotmc:spigot:1.17.1-R0.1-SNAPSHOT/maven-metadata.xml in everything (https://repo.citizensnpcs.co)
Failed to transfer Could not find metadata org.spigotmc:spigot:1.18.2-R0.1-SNAPSHOT/maven-metadata.xml in everything (https://repo.citizensnpcs.co)
Failed to transfer Could not find metadata org.spigotmc:spigot-api:1.18.2-R0.1-SNAPSHOT/maven-metadata.xml in everything (https://repo.citizensnpcs.co)
Failed to transfer Could not find metadata org.spigotmc:spigot-api:1.18.2-R0.1-SNAPSHOT/maven-metadata.xml in minecraft-libraries (https://libraries.minecraft.net/)
Failed to transfer Could not find artifact org.spigotmc:spigot:jar:remapped-mojang:1.19.1-R0.1-SNAPSHOT in everything (https://repo.citizensnpcs.co)
Modules changed, recalculating dependency graph
Established TCP socket on 43818
[workspace] $ /usr/lib/jvm/java-17-openjdk//bin/java -Djava.awt.headless=true -Djava.awt.headless=true -cp /var/lib/jenkins/plugins/maven-plugin/WEB-INF/lib/maven35-agent-1.13.jar:/var/lib/jenkins/tools/hudson.tasks.Maven_MavenInstallation/Maven_3.6.3/boot/plexus-classworlds-2.6.0.jar:/var/lib/jenkins/tools/hudson.tasks.Maven_MavenInstallation/Maven_3.6.3/conf/logging jenkins.maven3.agent.Maven35Main /var/lib/jenkins/tools/hudson.tasks.Maven_MavenInstallation/Maven_3.6.3 /var/lib/jenkins/%C/jenkins/war/WEB-INF/lib/remoting-3028.va_a_436db_35078.jar /var/lib/jenkins/plugins/maven-plugin/WEB-INF/lib/maven35-interceptor-1.13.jar /var/lib/jenkins/plugins/maven-plugin/WEB-INF/lib/maven3-interceptor-commons-1.13.jar 43818
<===[JENKINS REMOTING CAPACITY]===>channel started
Executing Maven:  -B -f /var/lib/jenkins/jobs/Citizens2/workspace/pom.xml clean package install -DBUILD_NUMBER=2647
[INFO] Scanning for projects...
[INFO] ------------------------------------------------------------------------
[INFO] Reactor Build Order:
[INFO] 
[INFO] citizens-parent                                                    [pom]
[INFO] citizens-main                                                      [jar]
[INFO] citizens-v1_8_R3                                                   [jar]
[INFO] citizens-v1_12_R1                                                  [jar]
[INFO] citizens-v1_16_R3                                                  [jar]
[INFO] citizens-v1_17_R1                                                  [jar]
[INFO] citizens-v1_18_R2                                                  [jar]
[INFO] citizens-v1_19_R1                                                  [jar]
[INFO] citizens                                                           [pom]
[INFO] 
[INFO] ------------------< net.citizensnpcs:citizens-parent >------------------
[INFO] Building citizens-parent 2.0.30-SNAPSHOT                           [1/9]
[INFO] --------------------------------[ pom ]---------------------------------
[INFO] 
[INFO] --- maven-clean-plugin:2.5:clean (default-clean) @ citizens-parent ---
[INFO] 
[INFO] --- maven-install-plugin:2.4:install (default-install) @ citizens-parent ---
[INFO] Installing /var/lib/jenkins/jobs/Citizens2/workspace/pom.xml to /var/lib/jenkins/.m2/repository/net/citizensnpcs/citizens-parent/2.0.30-SNAPSHOT/citizens-parent-2.0.30-SNAPSHOT.pom
Started calculate disk usage of build
Finished Calculation of disk usage of build in 0 seconds
Started calculate disk usage of workspace
Finished Calculation of disk usage of workspace in 0 seconds
[INFO] 
[INFO] -------------------< net.citizensnpcs:citizens-main >-------------------
[INFO] Building citizens-main 2.0.30-SNAPSHOT                             [2/9]
[INFO] --------------------------------[ jar ]---------------------------------
[WARNING] The POM for org.spigotmc:spigot:jar:1.19.1-R0.1-SNAPSHOT is missing, no dependency information available
Started calculate disk usage of build
Finished Calculation of disk usage of build in 0 seconds
Started calculate disk usage of workspace
Finished Calculation of disk usage of workspace in 0 seconds
[INFO] ------------------------------------------------------------------------
[INFO] Reactor Summary for citizens-parent 2.0.30-SNAPSHOT:
[INFO] 
[INFO] citizens-parent .................................... SUCCESS [  1.000 s]
[INFO] citizens-main ...................................... FAILURE [  0.549 s]
[INFO] citizens-v1_8_R3 ................................... SKIPPED
[INFO] citizens-v1_12_R1 .................................. SKIPPED
[INFO] citizens-v1_16_R3 .................................. SKIPPED
[INFO] citizens-v1_17_R1 .................................. SKIPPED
[INFO] citizens-v1_18_R2 .................................. SKIPPED
[INFO] citizens-v1_19_R1 .................................. SKIPPED
[INFO] citizens ........................................... SKIPPED
[INFO] ------------------------------------------------------------------------
[INFO] BUILD FAILURE
[INFO] ------------------------------------------------------------------------
[INFO] Total time:  4.353 s
[INFO] Finished at: 2022-07-28T07:38:32Z
[INFO] ------------------------------------------------------------------------
Waiting for Jenkins to finish collecting data
[JENKINS] Archiving /var/lib/jenkins/jobs/Citizens2/workspace/v1_17_R1/pom.xml to net.citizensnpcs/citizens-v1_17_R1/2.0.30-SNAPSHOT/citizens-v1_17_R1-2.0.30-SNAPSHOT.pom
[ERROR] Failed to execute goal on project citizens-main: Could not resolve dependencies for project net.citizensnpcs:citizens-main:jar:2.0.30-SNAPSHOT: Failure to find org.spigotmc:spigot:jar:1.19.1-R0.1-SNAPSHOT in https://hub.spigotmc.org/nexus/content/repositories/snapshots/ was cached in the local repository, resolution will not be reattempted until the update interval of spigot-repo has elapsed or updates are forced -> [Help 1]
[ERROR] 
[ERROR] To see the full stack trace of the errors, re-run Maven with the -e switch.
[ERROR] Re-run Maven using the -X switch to enable full debug logging.
[JENKINS] Archiving /var/lib/jenkins/jobs/Citizens2/workspace/v1_18_R2/pom.xml to net.citizensnpcs/citizens-v1_18_R2/2.0.30-SNAPSHOT/citizens-v1_18_R2-2.0.30-SNAPSHOT.pom
[ERROR] 
[ERROR] For more information about the errors and possible solutions, please read the following articles:
[ERROR] [Help 1] http://cwiki.apache.org/confluence/display/MAVEN/DependencyResolutionException
[ERROR] 
[ERROR] After correcting the problems, you can resume the build with the command
[ERROR]   mvn <goals> -rf :citizens-main
[JENKINS] Archiving /var/lib/jenkins/jobs/Citizens2/workspace/v1_16_R3/pom.xml to net.citizensnpcs/citizens-v1_16_R3/2.0.30-SNAPSHOT/citizens-v1_16_R3-2.0.30-SNAPSHOT.pom
[JENKINS] Archiving /var/lib/jenkins/jobs/Citizens2/workspace/dist/pom.xml to net.citizensnpcs/citizens/2.0.30-SNAPSHOT/citizens-2.0.30-SNAPSHOT.pom
[JENKINS] Archiving /var/lib/jenkins/jobs/Citizens2/workspace/main/pom.xml to net.citizensnpcs/citizens-main/2.0.30-SNAPSHOT/citizens-main-2.0.30-SNAPSHOT.pom
[JENKINS] Archiving /var/lib/jenkins/jobs/Citizens2/workspace/v1_8_R3/pom.xml to net.citizensnpcs/citizens-v1_8_R3/2.0.30-SNAPSHOT/citizens-v1_8_R3-2.0.30-SNAPSHOT.pom
[JENKINS] Archiving /var/lib/jenkins/jobs/Citizens2/workspace/v1_12_R1/pom.xml to net.citizensnpcs/citizens-v1_12_R1/2.0.30-SNAPSHOT/citizens-v1_12_R1-2.0.30-SNAPSHOT.pom
[JENKINS] Archiving /var/lib/jenkins/jobs/Citizens2/workspace/v1_19_R1/pom.xml to net.citizensnpcs/citizens-v1_19_R1/2.0.30-SNAPSHOT/citizens-v1_19_R1-2.0.30-SNAPSHOT.pom
[JENKINS] Archiving /var/lib/jenkins/jobs/Citizens2/workspace/pom.xml to net.citizensnpcs/citizens-parent/2.0.30-SNAPSHOT/citizens-parent-2.0.30-SNAPSHOT.pom
channel stopped
Archiving artifacts
[Set GitHub commit status (universal)] ERROR on repos [[email protected][nodeId=MDEwOlJlcG9zaXRvcnkzNDcyMTg3,description=Citizens - the premier plugin and API for creating server-side NPCs in Minecraft.,homepage=https://citizensnpcs.co,name=Citizens2,fork=false,archived=false,visibility=public,size=73473,milestones={},language=Java,commits={},source=<null>,parent=<null>,isTemplate=false,compareUsePaginatedCommits=false,url=https://api.github.com/repos/CitizensDev/Citizens2,id=3472187,nodeId=<null>,createdAt=2012-02-17T17:36:29Z,updatedAt=2022-07-28T05:59:08Z]] (sha:e9d197e) with context:ci/jenkins/build-status
Setting commit status on GitHub for https://github.com/CitizensDev/Citizens2/commit/e9d197eab0f2cb0c071927235a49cefdb90e7a82
Started calculate disk usage of build
Finished Calculation of disk usage of build in 0 seconds
Started calculate disk usage of workspace
Finished Calculation of disk usage of workspace in 0 seconds
Sending notification to Discord.
Finished: FAILURE