Console Output

Started by GitHub push by fullwall
Started by upstream project "CitizensAPI" build number 875
originally caused by:
 Started by GitHub push by fullwall
Started by upstream project "CitizensAPI" build number 875
originally caused by:
 Started by GitHub push by fullwall
Running as SYSTEM
Building in workspace /var/lib/jenkins/jobs/Citizens2/workspace
The recommended git tool is: NONE
No credentials specified
Wiping out workspace first.
Cloning the remote Git repository
Cloning repository https://github.com/CitizensDev/Citizens2.git
 > git init /var/lib/jenkins/jobs/Citizens2/workspace # timeout=10
Fetching upstream changes from https://github.com/CitizensDev/Citizens2.git
 > git --version # timeout=10
 > git --version # 'git version 1.8.3.1'
 > git fetch --tags --progress https://github.com/CitizensDev/Citizens2.git +refs/heads/*:refs/remotes/origin/* # timeout=10
 > git config remote.origin.url https://github.com/CitizensDev/Citizens2.git # timeout=10
 > git config --add remote.origin.fetch +refs/heads/*:refs/remotes/origin/* # timeout=10
Avoid second fetch
 > git rev-parse origin/master^{commit} # timeout=10
Checking out Revision 748af9f9bd55c02b110d867bac59e44540e9a6d1 (origin/master)
 > git config core.sparsecheckout # timeout=10
 > git checkout -f 748af9f9bd55c02b110d867bac59e44540e9a6d1 # timeout=10
Commit message: "Implement new methods"
 > git rev-list --no-walk e9d197eab0f2cb0c071927235a49cefdb90e7a82 # timeout=10
 > git tag -a -f -m Jenkins Build #2648 jenkins-Citizens2-2648 # timeout=10
false
Parsing POMs
Modules changed, recalculating dependency graph
Established TCP socket on 33207
[workspace] $ /usr/lib/jvm/java-17-openjdk//bin/java -Djava.awt.headless=true -Djava.awt.headless=true -cp /var/lib/jenkins/plugins/maven-plugin/WEB-INF/lib/maven35-agent-1.13.jar:/var/lib/jenkins/tools/hudson.tasks.Maven_MavenInstallation/Maven_3.6.3/boot/plexus-classworlds-2.6.0.jar:/var/lib/jenkins/tools/hudson.tasks.Maven_MavenInstallation/Maven_3.6.3/conf/logging jenkins.maven3.agent.Maven35Main /var/lib/jenkins/tools/hudson.tasks.Maven_MavenInstallation/Maven_3.6.3 /var/lib/jenkins/%C/jenkins/war/WEB-INF/lib/remoting-3028.va_a_436db_35078.jar /var/lib/jenkins/plugins/maven-plugin/WEB-INF/lib/maven35-interceptor-1.13.jar /var/lib/jenkins/plugins/maven-plugin/WEB-INF/lib/maven3-interceptor-commons-1.13.jar 33207
<===[JENKINS REMOTING CAPACITY]===>channel started
Executing Maven:  -B -f /var/lib/jenkins/jobs/Citizens2/workspace/pom.xml clean package install -DBUILD_NUMBER=2648
[INFO] Scanning for projects...
[INFO] ------------------------------------------------------------------------
[INFO] Reactor Build Order:
[INFO] 
[INFO] citizens-parent                                                    [pom]
[INFO] citizens-main                                                      [jar]
[INFO] citizens-v1_8_R3                                                   [jar]
[INFO] citizens-v1_12_R1                                                  [jar]
[INFO] citizens-v1_16_R3                                                  [jar]
[INFO] citizens-v1_17_R1                                                  [jar]
[INFO] citizens-v1_18_R2                                                  [jar]
[INFO] citizens-v1_19_R1                                                  [jar]
[INFO] citizens                                                           [pom]
[INFO] 
[INFO] ------------------< net.citizensnpcs:citizens-parent >------------------
[INFO] Building citizens-parent 2.0.30-SNAPSHOT                           [1/9]
[INFO] --------------------------------[ pom ]---------------------------------
[INFO] 
[INFO] --- maven-clean-plugin:2.5:clean (default-clean) @ citizens-parent ---
[INFO] 
[INFO] --- maven-install-plugin:2.4:install (default-install) @ citizens-parent ---
[INFO] Installing /var/lib/jenkins/jobs/Citizens2/workspace/pom.xml to /var/lib/jenkins/.m2/repository/net/citizensnpcs/citizens-parent/2.0.30-SNAPSHOT/citizens-parent-2.0.30-SNAPSHOT.pom
Started calculate disk usage of build
Finished Calculation of disk usage of build in 0 seconds
Started calculate disk usage of workspace
Finished Calculation of disk usage of workspace in 0 seconds
[INFO] 
[INFO] -------------------< net.citizensnpcs:citizens-main >-------------------
[INFO] Building citizens-main 2.0.30-SNAPSHOT                             [2/9]
[INFO] --------------------------------[ jar ]---------------------------------
[WARNING] The POM for org.spigotmc:spigot:jar:1.19.1-R0.1-SNAPSHOT is missing, no dependency information available
Started calculate disk usage of build
Finished Calculation of disk usage of build in 0 seconds
Started calculate disk usage of workspace
Finished Calculation of disk usage of workspace in 0 seconds
[INFO] ------------------------------------------------------------------------
[INFO] Reactor Summary for citizens-parent 2.0.30-SNAPSHOT:
[INFO] 
[INFO] citizens-parent .................................... SUCCESS [  1.716 s]
[INFO] citizens-main ...................................... FAILURE [  0.778 s]
[INFO] citizens-v1_8_R3 ................................... SKIPPED
[INFO] citizens-v1_12_R1 .................................. SKIPPED
[INFO] citizens-v1_16_R3 .................................. SKIPPED
[INFO] citizens-v1_17_R1 .................................. SKIPPED
[INFO] citizens-v1_18_R2 .................................. SKIPPED
[INFO] citizens-v1_19_R1 .................................. SKIPPED
[INFO] citizens ........................................... SKIPPED
[INFO] ------------------------------------------------------------------------
[INFO] BUILD FAILURE
[INFO] ------------------------------------------------------------------------
[INFO] Total time:  7.757 s
[INFO] Finished at: 2022-07-28T07:45:36Z
[INFO] ------------------------------------------------------------------------
[ERROR] Failed to execute goal on project citizens-main: Could not resolve dependencies for project net.citizensnpcs:citizens-main:jar:2.0.30-SNAPSHOT: Failure to find org.spigotmc:spigot:jar:1.19.1-R0.1-SNAPSHOT in https://hub.spigotmc.org/nexus/content/repositories/snapshots/ was cached in the local repository, resolution will not be reattempted until the update interval of spigot-repo has elapsed or updates are forced -> [Help 1]
[ERROR] 
[ERROR] To see the full stack trace of the errors, re-run Maven with the -e switch.
[ERROR] Re-run Maven using the -X switch to enable full debug logging.
[ERROR] 
[ERROR] For more information about the errors and possible solutions, please read the following articles:
[ERROR] [Help 1] http://cwiki.apache.org/confluence/display/MAVEN/DependencyResolutionException
[ERROR] 
[ERROR] After correcting the problems, you can resume the build with the command
[ERROR]   mvn <goals> -rf :citizens-main
Waiting for Jenkins to finish collecting data
[JENKINS] Archiving /var/lib/jenkins/jobs/Citizens2/workspace/v1_17_R1/pom.xml to net.citizensnpcs/citizens-v1_17_R1/2.0.30-SNAPSHOT/citizens-v1_17_R1-2.0.30-SNAPSHOT.pom
[JENKINS] Archiving /var/lib/jenkins/jobs/Citizens2/workspace/v1_18_R2/pom.xml to net.citizensnpcs/citizens-v1_18_R2/2.0.30-SNAPSHOT/citizens-v1_18_R2-2.0.30-SNAPSHOT.pom
[JENKINS] Archiving /var/lib/jenkins/jobs/Citizens2/workspace/v1_16_R3/pom.xml to net.citizensnpcs/citizens-v1_16_R3/2.0.30-SNAPSHOT/citizens-v1_16_R3-2.0.30-SNAPSHOT.pom
[JENKINS] Archiving /var/lib/jenkins/jobs/Citizens2/workspace/dist/pom.xml to net.citizensnpcs/citizens/2.0.30-SNAPSHOT/citizens-2.0.30-SNAPSHOT.pom
[JENKINS] Archiving /var/lib/jenkins/jobs/Citizens2/workspace/main/pom.xml to net.citizensnpcs/citizens-main/2.0.30-SNAPSHOT/citizens-main-2.0.30-SNAPSHOT.pom
[JENKINS] Archiving /var/lib/jenkins/jobs/Citizens2/workspace/v1_8_R3/pom.xml to net.citizensnpcs/citizens-v1_8_R3/2.0.30-SNAPSHOT/citizens-v1_8_R3-2.0.30-SNAPSHOT.pom
[JENKINS] Archiving /var/lib/jenkins/jobs/Citizens2/workspace/v1_12_R1/pom.xml to net.citizensnpcs/citizens-v1_12_R1/2.0.30-SNAPSHOT/citizens-v1_12_R1-2.0.30-SNAPSHOT.pom
[JENKINS] Archiving /var/lib/jenkins/jobs/Citizens2/workspace/v1_19_R1/pom.xml to net.citizensnpcs/citizens-v1_19_R1/2.0.30-SNAPSHOT/citizens-v1_19_R1-2.0.30-SNAPSHOT.pom
[JENKINS] Archiving /var/lib/jenkins/jobs/Citizens2/workspace/pom.xml to net.citizensnpcs/citizens-parent/2.0.30-SNAPSHOT/citizens-parent-2.0.30-SNAPSHOT.pom
channel stopped
Archiving artifacts
[Set GitHub commit status (universal)] ERROR on repos [[email protected][nodeId=MDEwOlJlcG9zaXRvcnkzNDcyMTg3,description=Citizens - the premier plugin and API for creating server-side NPCs in Minecraft.,homepage=https://citizensnpcs.co,name=Citizens2,fork=false,archived=false,visibility=public,size=73473,milestones={},language=Java,commits={},source=<null>,parent=<null>,isTemplate=false,compareUsePaginatedCommits=false,url=https://api.github.com/repos/CitizensDev/Citizens2,id=3472187,nodeId=<null>,createdAt=2012-02-17T17:36:29Z,updatedAt=2022-07-28T05:59:08Z]] (sha:748af9f) with context:ci/jenkins/build-status
Setting commit status on GitHub for https://github.com/CitizensDev/Citizens2/commit/748af9f9bd55c02b110d867bac59e44540e9a6d1
Started calculate disk usage of build
Finished Calculation of disk usage of build in 0 seconds
Started calculate disk usage of workspace
Finished Calculation of disk usage of workspace in 0 seconds
Sending notification to Discord.
Finished: FAILURE